{"text_format":"1","workbook":"xlsx","n_sheets":4,"sheets":["Log2021","Log 2022","Location","LongLat"],"not_rendered":{"charts":0,"images":0,"macros":1,"external_links":0,"defined_names":15,"comments":0,"pivot_tables":0},"unopened":[],"bounds":{"document_bytes":16777216,"sheet_cells":100000,"rows_first":2000,"rows_last":500,"rows_between":2000,"halvings":0,"cell_chars":16384,"cell_head_chars":4096},"cells_cut":0,"cells_raw":0,"read":"whole","date_system":"1900"}

{"sheet":"Log2021","index":0,"n_rows":13,"n_cols":33,"rows_kept":13,"cut":false,"hidden":false,"merged":[]}
["Month",1,2,3,4,5,6,7,8,9,10,11,12,13,14,15,16,17,18,19,20,21,22,23,24,25,26,27,28,29,30,31,"Total"]
["January",null,null,null,null,null,null,null,null,null,null,null,null,null,null,null,null,null,null,null,null,null,null,null,null,null,null,null,null,null,null,null,{"$f":"SUM(B2:AF2)","v":0}]
["February",null,null,null,null,null,null,null,null,null,null,null,null,null,null,null,null,null,null,null,null,null,null,null,null,null,null,null,null,null,null,null,{"$f":"SUM(B3:AF3)+AG2","v":0}]
["March",null,null,null,null,null,null,null,null,null,null,null,null,null,null,null,null,null,null,null,null,null,null,null,null,null,null,null,null,null,null,null,{"$f":"SUM(B4:AF4)+AG3","v":0}]
["April",null,null,null,null,null,null,null,null,null,null,null,null,null,null,null,null,null,null,null,null,null,null,null,null,null,null,null,null,null,null,null,{"$f":"SUM(B5:AF5)+AG4","v":0}]
["May",null,null,null,null,null,null,null,null,null,null,null,null,null,null,null,null,null,null,null,null,null,null,null,null,null,null,null,null,null,null,null,0]
["June",null,null,null,null,null,null,null,null,null,null,null,null,null,null,null,null,null,null,null,null,null,null,null,null,null,null,null,null,null,null,null,0]
["July",null,null,null,null,null,null,null,null,null,null,null,null,null,null,null,null,null,null,null,null,null,null,null,null,null,null,null,null,null,null,null,0]
["August",null,null,null,null,null,null,null,null,null,null,null,null,null,null,null,null,null,null,null,null,null,null,null,null,null,null,null,null,null,null,null,0]
["September",null,null,null,null,null,null,null,null,null,null,null,null,null,null,null,null,null,null,null,null,null,null,null,null,null,null,null,null,null,null,null,0]
["October",null,null,null,null,null,null,null,null,null,null,null,null,null,null,null,null,null,null,null,null,null,null,null,null,null,null,null,null,null,null,null,0]
["November",null,null,null,null,null,null,null,null,null,null,null,null,null,null,null,null,null,null,null,null,null,null,null,null,null,null,null,null,null,null,null,0]
["December",null,null,null,null,null,null,null,null,null,null,null,null,null,null,null,null,null,null,null,null,null,null,null,null,null,null,null,null,null,null,null,0]

{"sheet":"Log 2022","index":1,"n_rows":13,"n_cols":33,"rows_kept":13,"cut":false,"hidden":false,"merged":[]}
["Month",1,2,3,4,5,6,7,8,9,10,11,12,13,14,15,16,17,18,19,20,21,22,23,24,25,26,27,28,29,30,31,"Total"]
["January",null,null,null,null,null,null,null,null,null,null,null,null,null,null,null,null,null,null,null,null,null,null,null,null,null,null,null,null,null,null,null,{"$f":"'Log2021'!AG13+SUM('Log 2022'!B2:AF2)","v":0}]
["February",null,null,null,null,null,null,null,null,null,null,null,null,null,null,null,null,null,null,null,null,null,null,null,null,null,null,null,null,null,null,null,{"$f":"AG2+SUM(B3:AF3)","v":0}]
["March",null,null,null,null,null,null,null,null,null,null,null,null,null,null,null,null,null,null,null,null,null,null,null,null,null,null,null,null,null,null,null,{"$f":"AG3+SUM(B4:AF4)","v":0}]
["April",null,null,null,null,null,null,null,null,null,null,null,null,null,null,null,null,null,null,null,null,null,null,null,null,null,null,null,null,null,null,null,0]
["May",null,null,null,null,null,null,null,null,null,null,null,null,null,null,null,null,null,null,null,null,null,null,null,null,null,null,null,null,null,null,null,0]
["June",null,null,null,null,null,null,null,null,null,null,null,null,null,null,null,null,null,null,null,null,null,null,null,null,null,null,null,null,null,null,null,0]
["July",null,null,null,null,null,null,null,null,null,null,null,null,null,null,null,null,null,null,null,null,null,null,null,null,null,null,null,null,null,null,null,0]
["August",null,null,null,null,null,null,null,null,null,null,null,null,null,null,null,null,null,null,null,null,null,null,null,null,null,null,null,null,null,null,null,0]
["September",null,null,null,null,null,null,null,null,null,null,null,null,null,null,null,null,null,null,null,null,null,null,null,null,null,null,null,null,null,null,null,0]
["October",null,null,null,null,null,null,null,null,null,null,null,null,null,null,null,null,null,null,null,null,null,null,null,null,null,null,null,null,null,null,null,0]
["November",null,null,null,null,null,null,null,null,null,null,null,null,null,null,null,null,null,null,null,null,null,null,null,null,null,null,null,null,null,null,null,0]
["December",null,null,null,null,null,null,null,null,null,null,null,null,null,null,null,null,null,null,null,null,null,null,null,null,null,null,null,null,null,null,null,0]

{"sheet":"Location","index":2,"n_rows":1515,"n_cols":54,"rows_kept":1515,"cut":false,"hidden":false,"merged":[[2,1,3,1],[2,2,3,2],[2,3,3,3],[2,4,3,4],[0,3,0,9]]}
["Source for this information is",null,null,"http://www.summitpost.org/appalachian-trail-mileage-chart/593282",null,null,null,null,null,null,null,null,null,null,null,null,null,null,null,null,null,null,null,null,null,null,null,null,null,null,null,null,null,null,null,null,null,null,null,null,null,null,null,null,null,null,null,null,null,null,null,null,null,28]
[]
["Distance","Trail Feature ","Elevation ","State","County"]
["from Springer ",null,null,null,null,"Long","Lat","Picture"]
[0,"Springer Mt.","3782’","GA","Fannin",null,null,"http://www.summitpost.org/mountain/rock/151895/springer-mountain.html"]
[0.2,"Springer Mt. Shelter (pic)","3730’","GA","Fannin",{"$f":"VLOOKUP(A6,LongLat!$A$2:$H$292,7,TRUE)","v":-84.193100000000001},{"$f":"VLOOKUP(A6,LongLat!$A$2:$H$292,8,TRUE)","v":34.629150000000003},"http://www.whiteblaze.net/atdatabase/shelters/images/1116.jpg"]
[1,"USFS 42","3350’","GA","Fannin",{"$f":"VLOOKUP(A7,LongLat!$A$2:$H$292,7,TRUE)","v":-84.193100000000001},{"$f":"VLOOKUP(A7,LongLat!$A$2:$H$292,8,TRUE)","v":34.629150000000003}]
[2.8,"Stover Creek Shelter (pic)","2870’","GA","Fannin",{"$f":"VLOOKUP(A8,LongLat!$A$2:$H$292,7,TRUE)","v":-84.1999},{"$f":"VLOOKUP(A8,LongLat!$A$2:$H$292,8,TRUE)","v":34.649450000000002},"http://whiteblaze.net/forum/vbg/files/1/6/4/1/DSCN0461.JPG"]
[3.8,"Stover Creek","2660’","GA","Fannin",{"$f":"VLOOKUP(A9,LongLat!$A$2:$H$292,7,TRUE)","v":-84.1999},{"$f":"VLOOKUP(A9,LongLat!$A$2:$H$292,8,TRUE)","v":34.649450000000002}]
[4.3,"Three Forks, USFS 58","2530’","GA","Fannin",{"$f":"VLOOKUP(A10,LongLat!$A$2:$H$292,7,TRUE)","v":-84.1999},{"$f":"VLOOKUP(A10,LongLat!$A$2:$H$292,8,TRUE)","v":34.649450000000002},"http://2.bp.blogspot.com/_qoImU6KwvUs/TSAr1qqII0I/AAAAAAAAAMc/MomciAivdHs/s1600/Appalachian+Trail+trip+2009+063.JPG"]
[5.0999999999999996,"Trail to Long Creek Falls","2800’","GA","Fannin",{"$f":"VLOOKUP(A11,LongLat!$A$2:$H$292,7,TRUE)","v":-84.1999},{"$f":"VLOOKUP(A11,LongLat!$A$2:$H$292,8,TRUE)","v":34.649450000000002},"http://www.summitpost.org/image/216145/382122/long-creek-falls.html"]
[6,"Logging Road","3000’","GA","Fannin",{"$f":"VLOOKUP(A12,LongLat!$A$2:$H$292,7,TRUE)","v":-84.1999},{"$f":"VLOOKUP(A12,LongLat!$A$2:$H$292,8,TRUE)","v":34.649450000000002}]
[7.8,"Hawk Mountain Shelter (pic)","3200’","GA","Fannin",{"$f":"VLOOKUP(A13,LongLat!$A$2:$H$292,7,TRUE)","v":-84.136399999999995},{"$f":"VLOOKUP(A13,LongLat!$A$2:$H$292,8,TRUE)","v":34.66583},"http://www.panoramio.com/photo/8842569"]
[8.3000000000000007,"Hightower Gap, USFS 42/69","2854’","GA","Fannin",{"$f":"VLOOKUP(A14,LongLat!$A$2:$H$292,7,TRUE)","v":-84.136399999999995},{"$f":"VLOOKUP(A14,LongLat!$A$2:$H$292,8,TRUE)","v":34.66583},"http://assets.alltrails.com/uploads/photo/image/10184611/extra_large_e72b38a21ec68bfee0d611f2ec20bc34.jpg"]
[10.199999999999999,"Horse Gap","2673’","GA","Fannin",{"$f":"VLOOKUP(A15,LongLat!$A$2:$H$292,7,TRUE)","v":-84.136399999999995},{"$f":"VLOOKUP(A15,LongLat!$A$2:$H$292,8,TRUE)","v":34.66583},"http://farm3.static.flickr.com/2103/3538610901_be600a8d77_b.jpg"]
[11.2,"Sassafras Mt.","3300’","GA","Lumpkin",{"$f":"VLOOKUP(A16,LongLat!$A$2:$H$292,7,TRUE)","v":-84.136399999999995},{"$f":"VLOOKUP(A16,LongLat!$A$2:$H$292,8,TRUE)","v":34.66583},"http://www.summitpost.org/mountain/rock/198668/sassafras-mountain.html"]
[11.8,"Cooper Gap, USFS 42/80","2800’","GA","Lumpkin",{"$f":"VLOOKUP(A17,LongLat!$A$2:$H$292,7,TRUE)","v":-84.136399999999995},{"$f":"VLOOKUP(A17,LongLat!$A$2:$H$292,8,TRUE)","v":34.66583}]
[12.4,"Justus Mt.","3224’","GA","Lumpkin",{"$f":"VLOOKUP(A18,LongLat!$A$2:$H$292,7,TRUE)","v":-84.136399999999995},{"$f":"VLOOKUP(A18,LongLat!$A$2:$H$292,8,TRUE)","v":34.66583}]
[13.8,"Justus Creek","2550’","GA","Lumpkin",{"$f":"VLOOKUP(A19,LongLat!$A$2:$H$292,7,TRUE)","v":-84.136399999999995},{"$f":"VLOOKUP(A19,LongLat!$A$2:$H$292,8,TRUE)","v":34.66583}]
[15.1,"Gooch Mountain Shelter (pic)","3000’","GA","Lumpkin",{"$f":"VLOOKUP(A20,LongLat!$A$2:$H$292,7,TRUE)","v":-84.034300000000002},{"$f":"VLOOKUP(A20,LongLat!$A$2:$H$292,8,TRUE)","v":34.653199999999998},"http://whiteblaze.net/forum/vbg/files/4/1/ga_-_gooch_mountain_shelter.jpg"]
[16.5,"Gooch Gap, USFS 42","2784’","GA","Lumpkin",{"$f":"VLOOKUP(A21,LongLat!$A$2:$H$292,7,TRUE)","v":-84.034300000000002},{"$f":"VLOOKUP(A21,LongLat!$A$2:$H$292,8,TRUE)","v":34.653199999999998}]
[18.7,"Ramrock Mt.","3260’","GA","Lumpkin",{"$f":"VLOOKUP(A22,LongLat!$A$2:$H$292,7,TRUE)","v":-84.034300000000002},{"$f":"VLOOKUP(A22,LongLat!$A$2:$H$292,8,TRUE)","v":34.653199999999998},"http://www.flickr.com/photos/tsd/3806159170/"]
[20.100000000000001,"Woody Gap, GA 60","3150’","GA","Lumpkin",{"$f":"VLOOKUP(A23,LongLat!$A$2:$H$292,7,TRUE)","v":-84.034300000000002},{"$f":"VLOOKUP(A23,LongLat!$A$2:$H$292,8,TRUE)","v":34.653199999999998},"http://www.panoramio.com/photo/22465809"]
[21.1,"Big Cedar Mt.","3737’","GA","Lumpkin",{"$f":"VLOOKUP(A24,LongLat!$A$2:$H$292,7,TRUE)","v":-84.034300000000002},{"$f":"VLOOKUP(A24,LongLat!$A$2:$H$292,8,TRUE)","v":34.653199999999998},"http://www.panoramio.com/photo/10488057"]
[22.4,"Dan Gap","3300’","GA","Union",{"$f":"VLOOKUP(A25,LongLat!$A$2:$H$292,7,TRUE)","v":-84.034300000000002},{"$f":"VLOOKUP(A25,LongLat!$A$2:$H$292,8,TRUE)","v":34.653199999999998}]
[25.2,"Burnett Field Mt.","3480’","GA","Union",{"$f":"VLOOKUP(A26,LongLat!$A$2:$H$292,7,TRUE)","v":-84.034300000000002},{"$f":"VLOOKUP(A26,LongLat!$A$2:$H$292,8,TRUE)","v":34.653199999999998}]
[25.7,"Jarrard Gap","3250’","GA","Union",{"$f":"VLOOKUP(A27,LongLat!$A$2:$H$292,7,TRUE)","v":-84.034300000000002},{"$f":"VLOOKUP(A27,LongLat!$A$2:$H$292,8,TRUE)","v":34.653199999999998}]
[27,"Woods Hole Shelter (pic)","3600’","GA","Union",{"$f":"VLOOKUP(A28,LongLat!$A$2:$H$292,7,TRUE)","v":-83.954999999999998},{"$f":"VLOOKUP(A28,LongLat!$A$2:$H$292,8,TRUE)","v":34.737130000000001},"http://www.flickr.com/photos/61273142@N00/124688117/"]
[27.1,"Bird Gap, Freeman Trail","3650’","GA","Union",{"$f":"VLOOKUP(A29,LongLat!$A$2:$H$292,7,TRUE)","v":-83.954999999999998},{"$f":"VLOOKUP(A29,LongLat!$A$2:$H$292,8,TRUE)","v":34.737130000000001},"http://www.flickr.com/photos/trancemist/3513186279/"]
[27.5,"Slaughter Creek Campsite","3800’","GA","Union",{"$f":"VLOOKUP(A30,LongLat!$A$2:$H$292,7,TRUE)","v":-83.954999999999998},{"$f":"VLOOKUP(A30,LongLat!$A$2:$H$292,8,TRUE)","v":34.737130000000001},"http://whiteblaze.net/forum/vbg/files/2/7/8/5/appalachian_trail_09_126.jpg"]
[28.3,"Blood Mt. & Shelter (pic)","4450’","GA","Union",{"$f":"VLOOKUP(A31,LongLat!$A$2:$H$292,7,TRUE)","v":-83.9375},{"$f":"VLOOKUP(A31,LongLat!$A$2:$H$292,8,TRUE)","v":34.739960000000004},"http://www.summitpost.org/view_object.php?object_id=268713&context_id=383841"]
[29.7,"Flatrock Gap, Byron Reese Memorial Trail","3450’","GA","Union",{"$f":"VLOOKUP(A32,LongLat!$A$2:$H$292,7,TRUE)","v":-83.9375},{"$f":"VLOOKUP(A32,LongLat!$A$2:$H$292,8,TRUE)","v":34.739960000000004}]
[30.7,"Neels Gap, US 19/129","3125’","GA","Union",{"$f":"VLOOKUP(A33,LongLat!$A$2:$H$292,7,TRUE)","v":-83.9375},{"$f":"VLOOKUP(A33,LongLat!$A$2:$H$292,8,TRUE)","v":34.739960000000004},"http://www.summitpost.org/image/426169/150881/at-at-wasaliyi-inn.html"]
[31.8,"Bull Gap","3690’","GA","Union",{"$f":"VLOOKUP(A34,LongLat!$A$2:$H$292,7,TRUE)","v":-83.9375},{"$f":"VLOOKUP(A34,LongLat!$A$2:$H$292,8,TRUE)","v":34.739960000000004},"http://www.pinhotitrailalliance.org/images/0-0bullgap.jpg"]
[32.200000000000003,"Levelland Mt.","3942’","GA","Union",{"$f":"VLOOKUP(A35,LongLat!$A$2:$H$292,7,TRUE)","v":-83.9375},{"$f":"VLOOKUP(A35,LongLat!$A$2:$H$292,8,TRUE)","v":34.739960000000004}]
[32.799999999999997,"Swaim Gap","3470’","GA","Union",{"$f":"VLOOKUP(A36,LongLat!$A$2:$H$292,7,TRUE)","v":-83.9375},{"$f":"VLOOKUP(A36,LongLat!$A$2:$H$292,8,TRUE)","v":34.739960000000004}]
[33.5,"Rock Spring Top","3520’","GA","Union",{"$f":"VLOOKUP(A37,LongLat!$A$2:$H$292,7,TRUE)","v":-83.9375},{"$f":"VLOOKUP(A37,LongLat!$A$2:$H$292,8,TRUE)","v":34.739960000000004}]
[34,"Corbin Horse Stamp","3620’","GA","Union",{"$f":"VLOOKUP(A38,LongLat!$A$2:$H$292,7,TRUE)","v":-83.9375},{"$f":"VLOOKUP(A38,LongLat!$A$2:$H$292,8,TRUE)","v":34.739960000000004}]
[34.1,"Wolf Laurel Top","3766’","GA","Union",{"$f":"VLOOKUP(A39,LongLat!$A$2:$H$292,7,TRUE)","v":-83.9375},{"$f":"VLOOKUP(A39,LongLat!$A$2:$H$292,8,TRUE)","v":34.739960000000004},"http://www.cnyhiking.com/WolfLaurelTop001.jpg"]
[34.9,"Baggs Creek Gap","3800’","GA","Union",{"$f":"VLOOKUP(A40,LongLat!$A$2:$H$292,7,TRUE)","v":-83.9375},{"$f":"VLOOKUP(A40,LongLat!$A$2:$H$292,8,TRUE)","v":34.739960000000004}]
[35.4,"Cowrock Mt.","3842’","GA","Union",{"$f":"VLOOKUP(A41,LongLat!$A$2:$H$292,7,TRUE)","v":-83.9375},{"$f":"VLOOKUP(A41,LongLat!$A$2:$H$292,8,TRUE)","v":34.739960000000004},"http://www.cnyhiking.com/CowrockMtn001.jpg"]
[36.200000000000003,"Tesnatee Gap, GA 348","3138’","GA","Union",{"$f":"VLOOKUP(A42,LongLat!$A$2:$H$292,7,TRUE)","v":-83.9375},{"$f":"VLOOKUP(A42,LongLat!$A$2:$H$292,8,TRUE)","v":34.739960000000004}]
[36.700000000000003,"Wildcat Mt.","3500’","GA","Union",{"$f":"VLOOKUP(A43,LongLat!$A$2:$H$292,7,TRUE)","v":-83.834400000000002},{"$f":"VLOOKUP(A43,LongLat!$A$2:$H$292,8,TRUE)","v":34.712389999999999},"http://www.cnyhiking.com/wildcatmtnsunset.JPG"]
[36.9,"Whitley Gap Shelter (pic)","3370’","GA","Union",{"$f":"VLOOKUP(A44,LongLat!$A$2:$H$292,7,TRUE)","v":-83.834400000000002},{"$f":"VLOOKUP(A44,LongLat!$A$2:$H$292,8,TRUE)","v":34.712389999999999}]
[37.1,"Hogpen Gap, GA 348","3450’","GA","White",{"$f":"VLOOKUP(A45,LongLat!$A$2:$H$292,7,TRUE)","v":-83.834400000000002},{"$f":"VLOOKUP(A45,LongLat!$A$2:$H$292,8,TRUE)","v":34.712389999999999},"http://notd.blogs.com/photos/tdg/hogpen_signjpg.jpg"]
[38,"White Oak Stamp","3470’","GA","White",{"$f":"VLOOKUP(A46,LongLat!$A$2:$H$292,7,TRUE)","v":-83.834400000000002},{"$f":"VLOOKUP(A46,LongLat!$A$2:$H$292,8,TRUE)","v":34.712389999999999}]
[39,"Poor Mt.","3620’","GA","White",{"$f":"VLOOKUP(A47,LongLat!$A$2:$H$292,7,TRUE)","v":-83.834400000000002},{"$f":"VLOOKUP(A47,LongLat!$A$2:$H$292,8,TRUE)","v":34.712389999999999}]
[40.700000000000003,"Sheep Rock Top","3600’","GA","White",{"$f":"VLOOKUP(A48,LongLat!$A$2:$H$292,7,TRUE)","v":-83.834400000000002},{"$f":"VLOOKUP(A48,LongLat!$A$2:$H$292,8,TRUE)","v":34.712389999999999}]
[41.5,"Low Gap Shelter (pic)","3050’","GA","White",{"$f":"VLOOKUP(A49,LongLat!$A$2:$H$292,7,TRUE)","v":-83.824700000000007},{"$f":"VLOOKUP(A49,LongLat!$A$2:$H$292,8,TRUE)","v":34.776179999999997}]
[42.9,"Poplar Stamp Gap","2990’","GA","White",{"$f":"VLOOKUP(A50,LongLat!$A$2:$H$292,7,TRUE)","v":-83.824700000000007},{"$f":"VLOOKUP(A50,LongLat!$A$2:$H$292,8,TRUE)","v":34.776179999999997},"http://www.flickr.com/photos/hikerdana/166750001/"]
[45.3,"Cold Springs Gap","3300’","GA","White",{"$f":"VLOOKUP(A51,LongLat!$A$2:$H$292,7,TRUE)","v":-83.824700000000007},{"$f":"VLOOKUP(A51,LongLat!$A$2:$H$292,8,TRUE)","v":34.776179999999997}]
[46.5,"Chattahoochee Gap","3500’","GA","White",{"$f":"VLOOKUP(A52,LongLat!$A$2:$H$292,7,TRUE)","v":-83.824700000000007},{"$f":"VLOOKUP(A52,LongLat!$A$2:$H$292,8,TRUE)","v":34.776179999999997}]
[47.1,"Red Clay Gap","3485’","GA","White",{"$f":"VLOOKUP(A53,LongLat!$A$2:$H$292,7,TRUE)","v":-83.824700000000007},{"$f":"VLOOKUP(A53,LongLat!$A$2:$H$292,8,TRUE)","v":34.776179999999997}]
[47.8,"campsite","3600’","GA","White",{"$f":"VLOOKUP(A54,LongLat!$A$2:$H$292,7,TRUE)","v":-83.824700000000007},{"$f":"VLOOKUP(A54,LongLat!$A$2:$H$292,8,TRUE)","v":34.776179999999997}]
[48,"spring","3500’","GA","White",{"$f":"VLOOKUP(A55,LongLat!$A$2:$H$292,7,TRUE)","v":-83.824700000000007},{"$f":"VLOOKUP(A55,LongLat!$A$2:$H$292,8,TRUE)","v":34.776179999999997}]
[48.7,"Blue Mt. Shelter (pic)","3900’","GA","White",{"$f":"VLOOKUP(A56,LongLat!$A$2:$H$292,7,TRUE)","v":-83.766800000000003},{"$f":"VLOOKUP(A56,LongLat!$A$2:$H$292,8,TRUE)","v":34.81711}]
[49.5,"Blue Mt.","4025’","GA","White",{"$f":"VLOOKUP(A57,LongLat!$A$2:$H$292,7,TRUE)","v":-83.766800000000003},{"$f":"VLOOKUP(A57,LongLat!$A$2:$H$292,8,TRUE)","v":34.81711}]
[50.9,"Unicoi Gap, GA 75","2949’","GA","Unicoi",{"$f":"VLOOKUP(A58,LongLat!$A$2:$H$292,7,TRUE)","v":-83.766800000000003},{"$f":"VLOOKUP(A58,LongLat!$A$2:$H$292,8,TRUE)","v":34.81711},"http://www.flickr.com/photos/15572047@N00/20147221"]
[51.5,"stream","3300’","GA","Towns",{"$f":"VLOOKUP(A59,LongLat!$A$2:$H$292,7,TRUE)","v":-83.766800000000003},{"$f":"VLOOKUP(A59,LongLat!$A$2:$H$292,8,TRUE)","v":34.81711}]
[52.2,"Rocky Mt.","4017’","GA","Towns",{"$f":"VLOOKUP(A60,LongLat!$A$2:$H$292,7,TRUE)","v":-83.766800000000003},{"$f":"VLOOKUP(A60,LongLat!$A$2:$H$292,8,TRUE)","v":34.81711},"http://urbanbaboon.blogspot.com/2007/03/at-rocky-mountain-trail.html"]
{"$rows_left_out":1456}
{"sheet":"LongLat","index":3,"n_rows":293,"n_cols":12,"rows_kept":293,"cut":false,"hidden":false,"merged":[]}
["Miles North","Next Shelter North","Elevation","Fee","Cap","State","Longitude","Latitude","Miles South","Next Shelter South"]
[0.2,2.2999999999999998,"3,730'","No",12,"Georgia",-84.193100000000001,34.629150000000003,2174.4,1.7]
[1.7,1.7,"3,300'","No",8,"Georgia",-84.198800000000006,34.617559999999997,0,0,null,"Original source for this data"]
[2.5,5.0999999999999996,"2,870'","No",6,"Georgia",-84.1999,34.649450000000002,2172.1,2.2999999999999998,null,"http://www.whiteblaze.net/cmps.php?page=shelters"]
[7.6,7.3,"3,200'","No",12,"Georgia",-84.136399999999995,34.66583,2167,5.0999999999999996]
[14.9,11.9,"3,000'","No",14,"Georgia",-84.034300000000002,34.653199999999998,2159.6999999999998,7.3]
[26.8,1.3,"3,600'","No",7,"Georgia",-83.954999999999998,34.737130000000001,2147.8000000000002,11.9]
[28.1,8.6,"4,450'","No",8,"Georgia",-83.9375,34.739960000000004,2146.5,1.3]
[36.700000000000003,4.4000000000000004,"3,370'","No",6,"Georgia",-83.834400000000002,34.712389999999999,2137.9,8.6]
[41.1,7.2,"3,050'","No",7,"Georgia",-83.824700000000007,34.776179999999997,2133.5,4.4000000000000004]
[48.3,7.7,"3,900’","No",7,"Georgia",-83.766800000000003,34.81711,2126.3000000000002,7.2]
[56,7.1,"4,200'","No",7,"Georgia",-83.676900000000003,34.803959999999996,2118.6,7.7]
[63.1,7.8,"3,350'","No",12,"Georgia",-83.646199999999993,34.882350000000002,2111.5,7.1]
[70.900000000000006,7.3,"3,050'","No",14,"Georgia",-83.588300000000004,34.946040000000004,2103.6999999999998,7.8]
[78.2,4.9000000000000004,"4,600'","No",8,"North Carolina",-83.581599999999995,35.020539999999997,2096.4,7.3]
[83.1,7.6,"4,760'","No",8,"North Carolina",-83.548199999999994,35.041829999999997,2091.5,4.9000000000000004]
[90.7,6.8,"4,540'","No",6,"North Carolina",-83.494900000000001,34.999870000000001,2083.9,7.6]
[90.7,6.8,"4,540'","No",8,"North Carolina",-83.494299999999996,34.998899999999999,2083.9,6.8]
[97.5,5.3,"4,940'","No",8,"North Carolina",-83.478899999999996,35.058909999999997,2077.1,6.8]
[102.8,9,"3,760'","No",8,"North Carolina",-83.523099999999999,35.091439999999999,2071.8000000000002,5.3]
[110.3,12.1,"4,600'","No",8,"North Carolina",-83.572500000000005,35.14414,2064.3000000000002,9]
[122.4,5.8,"4,920'","No",6,"North Carolina",-83.559899999999999,35.230899999999998,2052.1999999999998,12.1]
[128.19999999999999,4.9000000000000004,"4,115'","No",8,"North Carolina",-83.5822,35.282350000000001,2046.4,5.8]
[133.1,7.7,"2,300'","No",6,"North Carolina",-83.590199999999996,35.324179999999998,2041.5,4.9000000000000004]
[140.80000000000001,9.1,"4,330'","No",14,"North Carolina",-83.667000000000002,35.330680000000001,2033.8,7.7]
[149.9,6.1,"3,800'","No",6,"North Carolina",-83.733900000000006,35.37424,2024.7,9.1]
[156,6.6,"2,880'","No",6,"North Carolina",-83.773600000000002,35.415219999999998,2018.6,6.1]
[162.6,11.3,"1,775'","No",20,"North Carolina",-83.7941,35.448329999999999,2012,6.6]
[173.9,2.5,"4,570'","No",12,"Tennessee",-83.793599999999998,35.545780000000001,2000.7,11.3]
[176.4,2.9,"4,360'","No",14,"Tennessee",-83.766599999999997,35.56174,1998.2,2.5]
[179.3,6.3,"4,915'","No",12,"North Carolina",-83.732699999999994,35.561799999999998,1996.3,2.9]
[185.6,5.5,"4,880'","No",12,"Tennessee",-83.641900000000007,35.566249999999997,1989,6.3]
[191.1,1.7,"5,460'","No",12,"North Carolina",-83.568299999999994,35.5642,1983.5,5.5]
[192.8,6.3,"5,505'","No",12,"North Carolina",-83.542900000000003,35.565170000000002,1981.8,1.7]
[199.1,7.5,"5,870'","No",12,"Tennessee",-83.471400000000003,35.593739999999997,1975.5,6.3]
[200,"Off Trail","6,440'","No",0,"Tennessee",-83.433800000000005,35.652709999999999,"Off Trail","Off Trail"]
[206.6,7.4,"5,920'","No",12,"North Carolina",-83.386399999999995,35.629689999999997,1968,7.5]
[208,"Off Trail","3,660'","No",0,"North Carolina",-83.367999999999995,35.614510000000003,"Off Trail","Off Trail"]
[214,5.2,"5,280'","No",12,"North Carolina",-83.308599999999998,35.650739999999999,1960.6,7.4]
[219.2,7.7,"5,920'","No",12,"North Carolina",-83.256699999999995,35.693669999999997,1955.4,5.2]
[220,"Off Trail","5,420'","No",0,"North Carolina",-83.186499999999995,35.66592,"Off Trail","Off Trail"]
[226.9,7.1,"4,700'","No",12,"North Carolina",-83.182199999999995,35.727080000000001,1947.7,7.7]
[234,10.5,"2,600'","No",12,"Tennessee",-83.123699999999999,35.769219999999997,1940.6,7.1]
[244.5,8.1999999999999993,"2,850'","No",6,"North Carolina",-83.026300000000006,35.781660000000002,1930.1,10.5]
[252.7,4.9000000000000004,"3,530'","No",8,"North Carolina",-82.938599999999994,35.822339999999997,1921.9,8.1999999999999993]
[257.60000000000002,9.9,"4,260'","No",6,"Tennessee",-82.936700000000002,35.836449999999999,1917,4.9000000000000004]
[267.5,14.2,"2,330'","No",5,"North Carolina",-82.861400000000003,35.875830000000001,1907.1,9.9]
[281.7,8.6,"3,300'","No",5,"Tennessee",-82.790199999999999,35.951479999999997,1892.9,14.2]
[290.3,6.8,"3,620'","No",5,"North Carolina",-82.735900000000001,36.014989999999997,1884.3,8.6]
[297.10000000000002,5.9,"4,150'","No",6,"North Carolina",-82.657399999999996,36.056469999999997,1877.5,6.8]
[303,8.8000000000000007,"3,570'","No",8,"North Carolina",-82.596900000000005,36.034790000000001,1871.6,5.9]
[311.8,10,"4,255'","No",6,"North Carolina",-82.587199999999996,35.963949999999997,1862.8,8.8000000000000007]
[321.8,10.6,"5,100'","No",10,"Tennessee",-82.478300000000004,36,1852.8,10]
[332.4,10.5,"3,180'","No",6,"Tennessee",-82.433599999999998,36.066769999999998,1842.2,10.6]
[342.9,12.2,"3,070'","No",6,"Tennessee",-82.397000000000006,36.104170000000003,1831.7,10.5]
[355.1,8.8000000000000007,"3,900'","No",6,"Tennessee",-82.264200000000002,36.129240000000003,1819.5,12.2]
[363.9,6.4,"4,400'","No",10,"Tennessee",-82.161299999999997,36.148440000000001,1810.7,8.8000000000000007]
[370.3,4.8,"6,275'","No",15,"Tennessee",-82.122699999999995,36.104959999999998,1804.3,6.4]
[375.1,1.7,"5,050'","No",6,"North Carolina",-82.065899999999999,36.112270000000002,1799.5,4.8]
[376.8,8.1999999999999993,"4,550'","No",20,"North Carolina",-82.054400000000001,36.123539999999998,1797.8,1.7]
{"$rows_left_out":233}